{"text_format":"1","workbook":"xlsx","n_sheets":8,"sheets":["Instructions","EXAMPLE ONLY","CF9 OSCE","Extract Fees","Extract Expenses","Extract Mileage","Standards","Workings"],"not_rendered":{"charts":0,"images":1,"macros":1,"external_links":0,"defined_names":16,"comments":2,"pivot_tables":0},"unopened":[],"bounds":{"document_bytes":16777216,"sheet_cells":100000,"rows_first":2000,"rows_last":500,"rows_between":2000,"halvings":0,"cell_chars":16384,"cell_head_chars":4096},"cells_cut":0,"cells_raw":0,"read":"whole","date_system":"1900"}

{"sheet":"Instructions","index":0,"n_rows":9,"n_cols":2,"rows_kept":9,"cut":false,"hidden":true,"merged":[[2,1,2,11],[4,1,4,11],[6,1,6,11],[8,1,8,11]]}
[" Independent End-point Assessor claim"]
[]
[1,"Section A - input the following:\n\nFirst name, surname\nVendor number (this starts with a '2')\n\n* Address details (should only be completed if the information has changed)"]
[]
[2,"Section B - input the following:\n\nBank details (should only be completed if the information has changed)\nSort/swift code (should only be completed if the information has changed)\nAccount name/number (should only be completed if the information has changed)\n\nDay rate (select from the drop down list)"]
[]
{"$rows_left_out":4}
{"sheet":"EXAMPLE ONLY","index":1,"n_rows":74,"n_cols":12,"rows_kept":74,"cut":false,"hidden":false,"merged":[[9,2,9,3],[9,6,9,9],[1,1,2,6],[1,7,2,9],[3,1,3,7],[8,2,8,3],[8,6,8,9],[10,6,10,9],[11,2,11,3],[11,6,11,9],[12,6,12,9],[13,2,13,3],[13,6,13,9],[40,3,40,5],[14,2,14,3],[14,6,14,9],[15,2,15,3],[16,2,16,3],[17,2,17,3],[21,3,21,4],[35,3,35,5],[36,3,36,5],[37,3,37,5],[38,3,38,5],[39,3,39,5],[30,3,30,4],[31,3,31,4],[55,3,55,4],[41,3,41,5],[42,3,42,5],[43,3,43,5],[44,3,44,5],[45,3,45,5],[49,3,49,4],[50,3,50,4],[51,3,51,4],[52,3,52,4],[53,3,53,4],[54,3,54,4],[72,5,72,6],[56,3,56,4],[57,3,57,4],[58,3,58,4],[59,3,59,4],[62,1,65,3],[67,2,67,3],[7,11,15,13],[73,2,73,3],[73,5,73,6],[22,3,22,4],[23,3,23,4],[24,3,24,4],[25,3,25,4],[26,3,26,4],[27,3,27,4],[28,3,28,4],[29,3,29,4],[70,2,70,3],[70,5,70,6],[71,2,71,3],[71,5,71,6],[72,2,72,3]]}
[]
[null,"Claim form CF9 - for OSCE only",null,null,null,null,null,"v1.0"]
[]
[null,"Please email this form, by the 17th of the month to veterinarynursing@cityandguilds.com "]
[null,"Receipts of expenses incurred in connection with each activity, must be attached to your email."]
[]
{"$rows_left_out":69}
{"sheet":"CF9 OSCE","index":2,"n_rows":74,"n_cols":8,"rows_kept":74,"cut":false,"hidden":false,"merged":[[9,2,9,3],[9,6,9,9],[10,6,10,9],[11,2,11,3],[1,1,2,6],[1,7,2,9],[3,1,3,7],[8,2,8,3],[8,6,8,9],[11,6,11,9],[12,6,12,9],[13,2,13,3],[13,6,13,9],[14,2,14,3],[14,6,14,9],[29,3,29,4],[15,2,15,3],[16,2,16,3],[17,2,17,3],[21,3,21,4],[22,3,22,4],[23,3,23,4],[24,3,24,4],[25,3,25,4],[26,3,26,4],[27,3,27,4],[28,3,28,4],[44,3,44,5],[30,3,30,4],[31,3,31,4],[35,3,35,5],[36,3,36,5],[37,3,37,5],[38,3,38,5],[39,3,39,5],[40,3,40,5],[41,3,41,5],[42,3,42,5],[43,3,43,5],[59,3,59,4],[45,3,45,5],[49,3,49,4],[50,3,50,4],[51,3,51,4],[52,3,52,4],[53,3,53,4],[54,3,54,4],[55,3,55,4],[56,3,56,4],[57,3,57,4],[58,3,58,4],[72,2,72,3],[72,5,72,6],[73,2,73,3],[73,5,73,6],[62,1,65,3],[67,2,67,3],[70,2,70,3],[70,5,70,6],[71,2,71,3],[71,5,71,6]]}
[]
[null,"Claim form CF9 - for OSCE only",null,null,null,null,null,"v1.0"]
[]
[null,"Please email this form, by the 17th of the month to veterinarynursing@cityandguilds.com "]
[null,"Receipts of expenses incurred in connection with each activity, must be attached to your email."]
[]
{"$rows_left_out":69}
{"sheet":"Extract Fees","index":3,"n_rows":32,"n_cols":22,"rows_kept":32,"cut":false,"hidden":true,"merged":[[0,8,0,21]]}
[null,null,null,null,null,null,null,null,"End-point assessment details"]
["Vendor ","Day rate","Ref no:","Submission date","CO sig date","AO sig date","Fin Year","Fin Period","Activity Date","Standard","Std code","Component","Delivery method","Enrolment No. ","Apprentice name","Hours","EPA complete?","Placeholder 1","Placeholder 2","Placeholder 3","Notes","Amount"]
[{"$f":"#REF!","v":{"$error":"#REF!"}},{"$f":"#REF!","v":{"$error":"#REF!"}},{"$f":"#REF!","v":{"$error":"#REF!"}},{"$f":"#REF!","v":{"$error":"#REF!"}},{"$f":"#REF!","v":{"$error":"#REF!"}},{"$f":"#REF!","v":{"$error":"#REF!"}},{"$f":"IF(AND($F3>=Workings!$R$2,'Extract Fees'!$F3<=Workings!$S$2),Workings!$Q$2,IF(AND($F3>=Workings!$R$3,'Extract Fees'!$F3<=Workings!$S$3),Workings!$Q$3,IF(AND($F3>=Workings!$R$4,'Extract Fees'!$F3<=Workings!$S$4),Workings!$Q$4,IF(AND($F3>=Workings!$R$5,'Extract Fees'!$F3<=Workings!$S$5),Workings!$Q$5,IF(AND($F3>=Workings!$R$6,'Extract Fees'!$F3<=Workings!$S$6),Workings!$Q$6,IF(AND($F3>=Workings!$R$7,'Extract Fees'!$F3<=Workings!$S$7),Workings!$Q$7,IF(AND($F3>=Workings!$R$8,'Extract Fees'!$F3<=Workings!$S$8),Workings!$Q$8,IF(AND($F3>=Workings!$R$9,'Extract Fees'!$F3<=Workings!$S$9),Workings!$Q$9))))))))","v":{"$error":"#REF!"}},{"$f":"VLOOKUP(MONTH(F3),Workings!N:O,2,0)","v":{"$error":"#REF!"}},{"$f":"#REF!","v":{"$error":"#REF!"}},{"$f":"#REF!","v":{"$error":"#REF!"}},{"$f":"LEFT(J3,7)","v":{"$error":"#REF!"}},{"$f":"#REF!","v":{"$error":"#REF!"}},{"$f":"#REF!","v":{"$error":"#REF!"}},{"$f":"#REF!","v":{"$error":"#REF!"}},{"$f":"#REF!","v":{"$error":"#REF!"}},{"$f":"#REF!","v":{"$error":"#REF!"}},{"$f":"#REF!","v":{"$error":"#REF!"}},{"$f":"#REF!","v":{"$error":"#REF!"}},{"$f":"#REF!","v":{"$error":"#REF!"}},{"$f":"#REF!","v":{"$error":"#REF!"}},{"$f":"#REF!","v":{"$error":"#REF!"}},{"$f":"#REF!","v":{"$error":"#REF!"}}]
[{"$f":"#REF!","v":{"$error":"#REF!"}},{"$f":"#REF!","v":{"$error":"#REF!"}},{"$f":"#REF!","v":{"$error":"#REF!"}},{"$f":"#REF!","v":{"$error":"#REF!"}},{"$f":"#REF!","v":{"$error":"#REF!"}},{"$f":"#REF!","v":{"$error":"#REF!"}},{"$f":"IF(AND($F4>=Workings!$R$2,'Extract Fees'!$F4<=Workings!$S$2),Workings!$Q$2,IF(AND($F4>=Workings!$R$3,'Extract Fees'!$F4<=Workings!$S$3),Workings!$Q$3,IF(AND($F4>=Workings!$R$4,'Extract Fees'!$F4<=Workings!$S$4),Workings!$Q$4,IF(AND($F4>=Workings!$R$5,'Extract Fees'!$F4<=Workings!$S$5),Workings!$Q$5,IF(AND($F4>=Workings!$R$6,'Extract Fees'!$F4<=Workings!$S$6),Workings!$Q$6,IF(AND($F4>=Workings!$R$7,'Extract Fees'!$F4<=Workings!$S$7),Workings!$Q$7,IF(AND($F4>=Workings!$R$8,'Extract Fees'!$F4<=Workings!$S$8),Workings!$Q$8,IF(AND($F4>=Workings!$R$9,'Extract Fees'!$F4<=Workings!$S$9),Workings!$Q$9))))))))","v":{"$error":"#REF!"}},{"$f":"VLOOKUP(MONTH(F4),Workings!N:O,2,0)","v":{"$error":"#REF!"}},{"$f":"#REF!","v":{"$error":"#REF!"}},{"$f":"#REF!","v":{"$error":"#REF!"}},{"$f":"LEFT(J4,7)","v":{"$error":"#REF!"}},{"$f":"#REF!","v":{"$error":"#REF!"}},{"$f":"#REF!","v":{"$error":"#REF!"}},{"$f":"#REF!","v":{"$error":"#REF!"}},{"$f":"#REF!","v":{"$error":"#REF!"}},{"$f":"#REF!","v":{"$error":"#REF!"}},{"$f":"#REF!","v":{"$error":"#REF!"}},{"$f":"#REF!","v":{"$error":"#REF!"}},{"$f":"#REF!","v":{"$error":"#REF!"}},{"$f":"#REF!","v":{"$error":"#REF!"}},{"$f":"#REF!","v":{"$error":"#REF!"}},{"$f":"#REF!","v":{"$error":"#REF!"}}]
[{"$f":"#REF!","v":{"$error":"#REF!"}},{"$f":"#REF!","v":{"$error":"#REF!"}},{"$f":"#REF!","v":{"$error":"#REF!"}},{"$f":"#REF!","v":{"$error":"#REF!"}},{"$f":"#REF!","v":{"$error":"#REF!"}},{"$f":"#REF!","v":{"$error":"#REF!"}},{"$f":"IF(AND($F5>=Workings!$R$2,'Extract Fees'!$F5<=Workings!$S$2),Workings!$Q$2,IF(AND($F5>=Workings!$R$3,'Extract Fees'!$F5<=Workings!$S$3),Workings!$Q$3,IF(AND($F5>=Workings!$R$4,'Extract Fees'!$F5<=Workings!$S$4),Workings!$Q$4,IF(AND($F5>=Workings!$R$5,'Extract Fees'!$F5<=Workings!$S$5),Workings!$Q$5,IF(AND($F5>=Workings!$R$6,'Extract Fees'!$F5<=Workings!$S$6),Workings!$Q$6,IF(AND($F5>=Workings!$R$7,'Extract Fees'!$F5<=Workings!$S$7),Workings!$Q$7,IF(AND($F5>=Workings!$R$8,'Extract Fees'!$F5<=Workings!$S$8),Workings!$Q$8,IF(AND($F5>=Workings!$R$9,'Extract Fees'!$F5<=Workings!$S$9),Workings!$Q$9))))))))","v":{"$error":"#REF!"}},{"$f":"VLOOKUP(MONTH(F5),Workings!N:O,2,0)","v":{"$error":"#REF!"}},{"$f":"#REF!","v":{"$error":"#REF!"}},{"$f":"#REF!","v":{"$error":"#REF!"}},{"$error":"#REF!"},{"$f":"#REF!","v":{"$error":"#REF!"}},{"$f":"#REF!","v":{"$error":"#REF!"}},{"$f":"#REF!","v":{"$error":"#REF!"}},{"$f":"#REF!","v":{"$error":"#REF!"}},{"$f":"#REF!","v":{"$error":"#REF!"}},{"$f":"#REF!","v":{"$error":"#REF!"}},{"$f":"#REF!","v":{"$error":"#REF!"}},{"$f":"#REF!","v":{"$error":"#REF!"}},{"$f":"#REF!","v":{"$error":"#REF!"}},{"$f":"#REF!","v":{"$error":"#REF!"}},{"$f":"#REF!","v":{"$error":"#REF!"}}]
[{"$f":"#REF!","v":{"$error":"#REF!"}},{"$f":"#REF!","v":{"$error":"#REF!"}},{"$f":"#REF!","v":{"$error":"#REF!"}},{"$f":"#REF!","v":{"$error":"#REF!"}},{"$f":"#REF!","v":{"$error":"#REF!"}},{"$f":"#REF!","v":{"$error":"#REF!"}},{"$f":"IF(AND($F6>=Workings!$R$2,'Extract Fees'!$F6<=Workings!$S$2),Workings!$Q$2,IF(AND($F6>=Workings!$R$3,'Extract Fees'!$F6<=Workings!$S$3),Workings!$Q$3,IF(AND($F6>=Workings!$R$4,'Extract Fees'!$F6<=Workings!$S$4),Workings!$Q$4,IF(AND($F6>=Workings!$R$5,'Extract Fees'!$F6<=Workings!$S$5),Workings!$Q$5,IF(AND($F6>=Workings!$R$6,'Extract Fees'!$F6<=Workings!$S$6),Workings!$Q$6,IF(AND($F6>=Workings!$R$7,'Extract Fees'!$F6<=Workings!$S$7),Workings!$Q$7,IF(AND($F6>=Workings!$R$8,'Extract Fees'!$F6<=Workings!$S$8),Workings!$Q$8,IF(AND($F6>=Workings!$R$9,'Extract Fees'!$F6<=Workings!$S$9),Workings!$Q$9))))))))","v":{"$error":"#REF!"}},{"$f":"VLOOKUP(MONTH(F6),Workings!N:O,2,0)","v":{"$error":"#REF!"}},{"$f":"#REF!","v":{"$error":"#REF!"}},{"$f":"#REF!","v":{"$error":"#REF!"}},{"$error":"#REF!"},{"$f":"#REF!","v":{"$error":"#REF!"}},{"$f":"#REF!","v":{"$error":"#REF!"}},{"$f":"#REF!","v":{"$error":"#REF!"}},{"$f":"#REF!","v":{"$error":"#REF!"}},{"$f":"#REF!","v":{"$error":"#REF!"}},{"$f":"#REF!","v":{"$error":"#REF!"}},{"$f":"#REF!","v":{"$error":"#REF!"}},{"$f":"#REF!","v":{"$error":"#REF!"}},{"$f":"#REF!","v":{"$error":"#REF!"}},{"$f":"#REF!","v":{"$error":"#REF!"}},{"$f":"#REF!","v":{"$error":"#REF!"}}]
{"$rows_left_out":27}
{"sheet":"Extract Expenses","index":4,"n_rows":16,"n_cols":12,"rows_kept":16,"cut":false,"hidden":true,"merged":[]}
["Vendor ","Day rate","Ref no:","Submission date","CO sig date","AO sig date","Fin Year","Fin Period","Expense Date","Type of Expense claim","Notes","Amount"]
[{"$f":"#REF!","v":{"$error":"#REF!"}},{"$f":"#REF!","v":{"$error":"#REF!"}},{"$f":"#REF!","v":{"$error":"#REF!"}},{"$f":"#REF!","v":{"$error":"#REF!"}},{"$f":"#REF!","v":{"$error":"#REF!"}},{"$f":"#REF!","v":{"$error":"#REF!"}},{"$f":"IF(AND($F2>=Workings!$R$2,'Extract Expenses'!$F2<=Workings!$S$2),Workings!$Q$2,IF(AND($F2>=Workings!$R$3,'Extract Expenses'!$F2<=Workings!$S$3),Workings!$Q$3,IF(AND($F2>=Workings!$R$4,'Extract Expenses'!$F2<=Workings!$S$4),Workings!$Q$4,IF(AND($F2>=Workings!$R$5,'Extract Expenses'!$F2<=Workings!$S$5),Workings!$Q$5,IF(AND($F2>=Workings!$R$6,'Extract Expenses'!$F2<=Workings!$S$6),Workings!$Q$6,IF(AND($F2>=Workings!$R$7,'Extract Expenses'!$F2<=Workings!$S$7),Workings!$Q$7,IF(AND($F2>=Workings!$R$8,'Extract Expenses'!$F2<=Workings!$S$8),Workings!$Q$8,IF(AND($F2>=Workings!$R$9,'Extract Expenses'!$F2<=Workings!$S$9),Workings!$Q$9))))))))","v":{"$error":"#REF!"}},{"$f":"VLOOKUP(MONTH(F2),Workings!N:O,2,0)","v":{"$error":"#REF!"}},{"$f":"#REF!","v":{"$error":"#REF!"}},{"$f":"#REF!","v":{"$error":"#REF!"}},{"$f":"#REF!","v":{"$error":"#REF!"}},{"$f":"#REF!","v":{"$error":"#REF!"}}]
[{"$f":"#REF!","v":{"$error":"#REF!"}},{"$f":"#REF!","v":{"$error":"#REF!"}},{"$f":"#REF!","v":{"$error":"#REF!"}},{"$f":"#REF!","v":{"$error":"#REF!"}},{"$f":"#REF!","v":{"$error":"#REF!"}},{"$f":"#REF!","v":{"$error":"#REF!"}},{"$f":"IF(AND($F3>=Workings!$R$2,'Extract Expenses'!$F3<=Workings!$S$2),Workings!$Q$2,IF(AND($F3>=Workings!$R$3,'Extract Expenses'!$F3<=Workings!$S$3),Workings!$Q$3,IF(AND($F3>=Workings!$R$4,'Extract Expenses'!$F3<=Workings!$S$4),Workings!$Q$4,IF(AND($F3>=Workings!$R$5,'Extract Expenses'!$F3<=Workings!$S$5),Workings!$Q$5,IF(AND($F3>=Workings!$R$6,'Extract Expenses'!$F3<=Workings!$S$6),Workings!$Q$6,IF(AND($F3>=Workings!$R$7,'Extract Expenses'!$F3<=Workings!$S$7),Workings!$Q$7,IF(AND($F3>=Workings!$R$8,'Extract Expenses'!$F3<=Workings!$S$8),Workings!$Q$8,IF(AND($F3>=Workings!$R$9,'Extract Expenses'!$F3<=Workings!$S$9),Workings!$Q$9))))))))","v":{"$error":"#REF!"}},{"$f":"VLOOKUP(MONTH(F3),Workings!N:O,2,0)","v":{"$error":"#REF!"}},{"$f":"#REF!","v":{"$error":"#REF!"}},{"$f":"#REF!","v":{"$error":"#REF!"}},{"$f":"#REF!","v":{"$error":"#REF!"}},{"$f":"#REF!","v":{"$error":"#REF!"}}]
[{"$f":"#REF!","v":{"$error":"#REF!"}},{"$f":"#REF!","v":{"$error":"#REF!"}},{"$f":"#REF!","v":{"$error":"#REF!"}},{"$f":"#REF!","v":{"$error":"#REF!"}},{"$f":"#REF!","v":{"$error":"#REF!"}},{"$f":"#REF!","v":{"$error":"#REF!"}},{"$f":"IF(AND($F4>=Workings!$R$2,'Extract Expenses'!$F4<=Workings!$S$2),Workings!$Q$2,IF(AND($F4>=Workings!$R$3,'Extract Expenses'!$F4<=Workings!$S$3),Workings!$Q$3,IF(AND($F4>=Workings!$R$4,'Extract Expenses'!$F4<=Workings!$S$4),Workings!$Q$4,IF(AND($F4>=Workings!$R$5,'Extract Expenses'!$F4<=Workings!$S$5),Workings!$Q$5,IF(AND($F4>=Workings!$R$6,'Extract Expenses'!$F4<=Workings!$S$6),Workings!$Q$6,IF(AND($F4>=Workings!$R$7,'Extract Expenses'!$F4<=Workings!$S$7),Workings!$Q$7,IF(AND($F4>=Workings!$R$8,'Extract Expenses'!$F4<=Workings!$S$8),Workings!$Q$8,IF(AND($F4>=Workings!$R$9,'Extract Expenses'!$F4<=Workings!$S$9),Workings!$Q$9))))))))","v":{"$error":"#REF!"}},{"$f":"VLOOKUP(MONTH(F4),Workings!N:O,2,0)","v":{"$error":"#REF!"}},{"$f":"#REF!","v":{"$error":"#REF!"}},{"$f":"#REF!","v":{"$error":"#REF!"}},{"$f":"#REF!","v":{"$error":"#REF!"}},{"$f":"#REF!","v":{"$error":"#REF!"}}]
[{"$f":"#REF!","v":{"$error":"#REF!"}},{"$f":"#REF!","v":{"$error":"#REF!"}},{"$f":"#REF!","v":{"$error":"#REF!"}},{"$f":"#REF!","v":{"$error":"#REF!"}},{"$f":"#REF!","v":{"$error":"#REF!"}},{"$f":"#REF!","v":{"$error":"#REF!"}},{"$f":"IF(AND($F5>=Workings!$R$2,'Extract Expenses'!$F5<=Workings!$S$2),Workings!$Q$2,IF(AND($F5>=Workings!$R$3,'Extract Expenses'!$F5<=Workings!$S$3),Workings!$Q$3,IF(AND($F5>=Workings!$R$4,'Extract Expenses'!$F5<=Workings!$S$4),Workings!$Q$4,IF(AND($F5>=Workings!$R$5,'Extract Expenses'!$F5<=Workings!$S$5),Workings!$Q$5,IF(AND($F5>=Workings!$R$6,'Extract Expenses'!$F5<=Workings!$S$6),Workings!$Q$6,IF(AND($F5>=Workings!$R$7,'Extract Expenses'!$F5<=Workings!$S$7),Workings!$Q$7,IF(AND($F5>=Workings!$R$8,'Extract Expenses'!$F5<=Workings!$S$8),Workings!$Q$8,IF(AND($F5>=Workings!$R$9,'Extract Expenses'!$F5<=Workings!$S$9),Workings!$Q$9))))))))","v":{"$error":"#REF!"}},{"$f":"VLOOKUP(MONTH(F5),Workings!N:O,2,0)","v":{"$error":"#REF!"}},{"$f":"#REF!","v":{"$error":"#REF!"}},{"$f":"#REF!","v":{"$error":"#REF!"}},{"$f":"#REF!","v":{"$error":"#REF!"}},{"$f":"#REF!","v":{"$error":"#REF!"}}]
[{"$f":"#REF!","v":{"$error":"#REF!"}},{"$f":"#REF!","v":{"$error":"#REF!"}},{"$f":"#REF!","v":{"$error":"#REF!"}},{"$f":"#REF!","v":{"$error":"#REF!"}},{"$f":"#REF!","v":{"$error":"#REF!"}},{"$f":"#REF!","v":{"$error":"#REF!"}},{"$f":"IF(AND($F6>=Workings!$R$2,'Extract Expenses'!$F6<=Workings!$S$2),Workings!$Q$2,IF(AND($F6>=Workings!$R$3,'Extract Expenses'!$F6<=Workings!$S$3),Workings!$Q$3,IF(AND($F6>=Workings!$R$4,'Extract Expenses'!$F6<=Workings!$S$4),Workings!$Q$4,IF(AND($F6>=Workings!$R$5,'Extract Expenses'!$F6<=Workings!$S$5),Workings!$Q$5,IF(AND($F6>=Workings!$R$6,'Extract Expenses'!$F6<=Workings!$S$6),Workings!$Q$6,IF(AND($F6>=Workings!$R$7,'Extract Expenses'!$F6<=Workings!$S$7),Workings!$Q$7,IF(AND($F6>=Workings!$R$8,'Extract Expenses'!$F6<=Workings!$S$8),Workings!$Q$8,IF(AND($F6>=Workings!$R$9,'Extract Expenses'!$F6<=Workings!$S$9),Workings!$Q$9))))))))","v":{"$error":"#REF!"}},{"$f":"VLOOKUP(MONTH(F6),Workings!N:O,2,0)","v":{"$error":"#REF!"}},{"$f":"#REF!","v":{"$error":"#REF!"}},{"$f":"#REF!","v":{"$error":"#REF!"}},{"$f":"#REF!","v":{"$error":"#REF!"}},{"$f":"#REF!","v":{"$error":"#REF!"}}]
{"$rows_left_out":11}
{"sheet":"Extract Mileage","index":5,"n_rows":11,"n_cols":13,"rows_kept":11,"cut":false,"hidden":true,"merged":[]}
["Vendor ","Day rate","Ref no:","Submission date","CO sig date","AO sig date","Fin Year","Fin Period","Mileage Date","No. of miles","Notes","Rate per mile","Amount"]
[{"$f":"#REF!","v":{"$error":"#REF!"}},{"$f":"#REF!","v":{"$error":"#REF!"}},{"$f":"#REF!","v":{"$error":"#REF!"}},{"$f":"#REF!","v":{"$error":"#REF!"}},{"$f":"#REF!","v":{"$error":"#REF!"}},{"$f":"#REF!","v":{"$error":"#REF!"}},{"$f":"IF(AND($F2>=Workings!$R$2,'Extract Mileage'!$F2<=Workings!$S$2),Workings!$Q$2,IF(AND($F2>=Workings!$R$3,'Extract Mileage'!$F2<=Workings!$S$3),Workings!$Q$3,IF(AND($F2>=Workings!$R$4,'Extract Mileage'!$F2<=Workings!$S$4),Workings!$Q$4,IF(AND($F2>=Workings!$R$5,'Extract Mileage'!$F2<=Workings!$S$5),Workings!$Q$5,IF(AND($F2>=Workings!$R$6,'Extract Mileage'!$F2<=Workings!$S$6),Workings!$Q$6,IF(AND($F2>=Workings!$R$7,'Extract Mileage'!$F2<=Workings!$S$7),Workings!$Q$7,IF(AND($F2>=Workings!$R$8,'Extract Mileage'!$F2<=Workings!$S$8),Workings!$Q$8,IF(AND($F2>=Workings!$R$9,'Extract Mileage'!$F2<=Workings!$S$9),Workings!$Q$9))))))))","v":{"$error":"#REF!"}},{"$f":"VLOOKUP(MONTH(F2),Workings!N:O,2,0)","v":{"$error":"#REF!"}},{"$f":"#REF!","v":{"$error":"#REF!"}},{"$f":"#REF!","v":{"$error":"#REF!"}},{"$f":"#REF!","v":{"$error":"#REF!"}},{"$f":"#REF!","v":{"$error":"#REF!"}},{"$f":"#REF!","v":{"$error":"#REF!"}}]
[{"$f":"#REF!","v":{"$error":"#REF!"}},{"$f":"#REF!","v":{"$error":"#REF!"}},{"$f":"#REF!","v":{"$error":"#REF!"}},{"$f":"#REF!","v":{"$error":"#REF!"}},{"$f":"#REF!","v":{"$error":"#REF!"}},{"$f":"#REF!","v":{"$error":"#REF!"}},{"$f":"IF(AND($F3>=Workings!$R$2,'Extract Mileage'!$F3<=Workings!$S$2),Workings!$Q$2,IF(AND($F3>=Workings!$R$3,'Extract Mileage'!$F3<=Workings!$S$3),Workings!$Q$3,IF(AND($F3>=Workings!$R$4,'Extract Mileage'!$F3<=Workings!$S$4),Workings!$Q$4,IF(AND($F3>=Workings!$R$5,'Extract Mileage'!$F3<=Workings!$S$5),Workings!$Q$5,IF(AND($F3>=Workings!$R$6,'Extract Mileage'!$F3<=Workings!$S$6),Workings!$Q$6,IF(AND($F3>=Workings!$R$7,'Extract Mileage'!$F3<=Workings!$S$7),Workings!$Q$7,IF(AND($F3>=Workings!$R$8,'Extract Mileage'!$F3<=Workings!$S$8),Workings!$Q$8,IF(AND($F3>=Workings!$R$9,'Extract Mileage'!$F3<=Workings!$S$9),Workings!$Q$9))))))))","v":{"$error":"#REF!"}},{"$f":"VLOOKUP(MONTH(F3),Workings!N:O,2,0)","v":{"$error":"#REF!"}},{"$f":"#REF!","v":{"$error":"#REF!"}},{"$f":"#REF!","v":{"$error":"#REF!"}},{"$f":"#REF!","v":{"$error":"#REF!"}},{"$f":"#REF!","v":{"$error":"#REF!"}},{"$f":"#REF!","v":{"$error":"#REF!"}}]
[{"$f":"#REF!","v":{"$error":"#REF!"}},{"$f":"#REF!","v":{"$error":"#REF!"}},{"$f":"#REF!","v":{"$error":"#REF!"}},{"$f":"#REF!","v":{"$error":"#REF!"}},{"$f":"#REF!","v":{"$error":"#REF!"}},{"$f":"#REF!","v":{"$error":"#REF!"}},{"$f":"IF(AND($F4>=Workings!$R$2,'Extract Mileage'!$F4<=Workings!$S$2),Workings!$Q$2,IF(AND($F4>=Workings!$R$3,'Extract Mileage'!$F4<=Workings!$S$3),Workings!$Q$3,IF(AND($F4>=Workings!$R$4,'Extract Mileage'!$F4<=Workings!$S$4),Workings!$Q$4,IF(AND($F4>=Workings!$R$5,'Extract Mileage'!$F4<=Workings!$S$5),Workings!$Q$5,IF(AND($F4>=Workings!$R$6,'Extract Mileage'!$F4<=Workings!$S$6),Workings!$Q$6,IF(AND($F4>=Workings!$R$7,'Extract Mileage'!$F4<=Workings!$S$7),Workings!$Q$7,IF(AND($F4>=Workings!$R$8,'Extract Mileage'!$F4<=Workings!$S$8),Workings!$Q$8,IF(AND($F4>=Workings!$R$9,'Extract Mileage'!$F4<=Workings!$S$9),Workings!$Q$9))))))))","v":{"$error":"#REF!"}},{"$f":"VLOOKUP(MONTH(F4),Workings!N:O,2,0)","v":{"$error":"#REF!"}},{"$f":"#REF!","v":{"$error":"#REF!"}},{"$f":"#REF!","v":{"$error":"#REF!"}},{"$f":"#REF!","v":{"$error":"#REF!"}},{"$f":"#REF!","v":{"$error":"#REF!"}},{"$f":"#REF!","v":{"$error":"#REF!"}}]
[{"$f":"#REF!","v":{"$error":"#REF!"}},{"$f":"#REF!","v":{"$error":"#REF!"}},{"$f":"#REF!","v":{"$error":"#REF!"}},{"$f":"#REF!","v":{"$error":"#REF!"}},{"$f":"#REF!","v":{"$error":"#REF!"}},{"$f":"#REF!","v":{"$error":"#REF!"}},{"$f":"IF(AND($F5>=Workings!$R$2,'Extract Mileage'!$F5<=Workings!$S$2),Workings!$Q$2,IF(AND($F5>=Workings!$R$3,'Extract Mileage'!$F5<=Workings!$S$3),Workings!$Q$3,IF(AND($F5>=Workings!$R$4,'Extract Mileage'!$F5<=Workings!$S$4),Workings!$Q$4,IF(AND($F5>=Workings!$R$5,'Extract Mileage'!$F5<=Workings!$S$5),Workings!$Q$5,IF(AND($F5>=Workings!$R$6,'Extract Mileage'!$F5<=Workings!$S$6),Workings!$Q$6,IF(AND($F5>=Workings!$R$7,'Extract Mileage'!$F5<=Workings!$S$7),Workings!$Q$7,IF(AND($F5>=Workings!$R$8,'Extract Mileage'!$F5<=Workings!$S$8),Workings!$Q$8,IF(AND($F5>=Workings!$R$9,'Extract Mileage'!$F5<=Workings!$S$9),Workings!$Q$9))))))))","v":{"$error":"#REF!"}},{"$f":"VLOOKUP(MONTH(F5),Workings!N:O,2,0)","v":{"$error":"#REF!"}},{"$f":"#REF!","v":{"$error":"#REF!"}},{"$f":"#REF!","v":{"$error":"#REF!"}},{"$f":"#REF!","v":{"$error":"#REF!"}},{"$f":"#REF!","v":{"$error":"#REF!"}},{"$f":"#REF!","v":{"$error":"#REF!"}}]
[{"$f":"#REF!","v":{"$error":"#REF!"}},{"$f":"#REF!","v":{"$error":"#REF!"}},{"$f":"#REF!","v":{"$error":"#REF!"}},{"$f":"#REF!","v":{"$error":"#REF!"}},{"$f":"#REF!","v":{"$error":"#REF!"}},{"$f":"#REF!","v":{"$error":"#REF!"}},{"$f":"IF(AND($F6>=Workings!$R$2,'Extract Mileage'!$F6<=Workings!$S$2),Workings!$Q$2,IF(AND($F6>=Workings!$R$3,'Extract Mileage'!$F6<=Workings!$S$3),Workings!$Q$3,IF(AND($F6>=Workings!$R$4,'Extract Mileage'!$F6<=Workings!$S$4),Workings!$Q$4,IF(AND($F6>=Workings!$R$5,'Extract Mileage'!$F6<=Workings!$S$5),Workings!$Q$5,IF(AND($F6>=Workings!$R$6,'Extract Mileage'!$F6<=Workings!$S$6),Workings!$Q$6,IF(AND($F6>=Workings!$R$7,'Extract Mileage'!$F6<=Workings!$S$7),Workings!$Q$7,IF(AND($F6>=Workings!$R$8,'Extract Mileage'!$F6<=Workings!$S$8),Workings!$Q$8,IF(AND($F6>=Workings!$R$9,'Extract Mileage'!$F6<=Workings!$S$9),Workings!$Q$9))))))))","v":{"$error":"#REF!"}},{"$f":"VLOOKUP(MONTH(F6),Workings!N:O,2,0)","v":{"$error":"#REF!"}},{"$f":"#REF!","v":{"$error":"#REF!"}},{"$f":"#REF!","v":{"$error":"#REF!"}},{"$f":"#REF!","v":{"$error":"#REF!"}},{"$f":"#REF!","v":{"$error":"#REF!"}},{"$f":"#REF!","v":{"$error":"#REF!"}}]
{"$rows_left_out":6}
{"sheet":"Standards","index":6,"n_rows":76,"n_cols":1,"rows_kept":76,"cut":false,"hidden":true,"merged":[]}
["Qualification"]
["0143-02 Level 2 Golf Greenkeeping - Full Apprenticeship Package"]
["3817-22 Level 3 Operational Delivery Officer - End-point Assessment"]
["6090-50 Level 3 End-point assessment for ST0322/02 Refrigeration air conditioning and heat pump engineering technician"]
["7002-52 Level 2 Diploma for Hair Professionals - Hairdressing (End-Point Assessment - with centre venue)"]
["7002-53 Level 2 Diploma for Hair Professionals - Barbering (End-Point Assessment - with centre venue)"]
{"$rows_left_out":71}
{"sheet":"Workings","index":7,"n_rows":1001,"n_cols":19,"rows_kept":1001,"cut":false,"hidden":true,"merged":[]}
["SERIES",null,"Claim Number","Claim No. Code",null,"Component",null,"EPA Complete?",null,"Delivery method",null,"Day rates",null,"Month","Period"]
["*please select*",null,1,"0001",null,"Interview/Q&A",null,"Yes",null,"Face to face",null,250,null,1,5,null,2017,"2016-09-01","2017-08-31"]
["10252 (Apprenticeships)",null,2,"0002",null,"Structured meeting",null,null,null,"Remote",null,275,null,2,6,null,2018,"2017-09-01","2018-08-31"]
[null,null,3,"0003",null,"Portfolio/log book review",null,null,null,"Face to face - resit",null,300,null,3,7,null,2019,"2018-09-01","2019-08-31"]
["Earliest activity date",null,4,"0004",null,"Practical observation",null,null,null,"Remote - resit",null,325,null,4,8,null,2020,"2019-09-01","2020-08-31"]
[{"$f":"TODAY()-121","v":"2019-11-06"},null,5,"0005",null,"Professional discussion",null,null,null,null,null,350,null,5,9,null,2021,"2020-09-01","2021-08-31"]
{"$rows_left_out":995}